BDBM92481 Sennoside A, G
SMILES OC[C@H]1O[C@@H](Oc2cccc3[C@@H]([C@@H]4c5cccc(O[C@@H]6O[C@H](CO)[C@@H](O)[C@H](O)[C@H]6O)c5C(=O)c5c(O)cc(cc45)C(O)=O)c4cc(cc(O)c4C(=O)c23)C(O)=O)[C@H](O)[C@@H](O)[C@@H]1O
InChI Key InChIKey=IPQVTOJGNYVQEO-KGFNBKMBSA-N
Data  3 IC50
  Tab Delimited (TSV)   2D SDfile   Computed 3D by Vconf -m prep SDfile
Find this compound or compounds like it in BindingDB:
Activity Spreadsheet -- Enzyme Inhibition Constant Data from BindingDB
Found 3 hits for monomerid = 92481
TargetPlasminogen activator inhibitor 1(Homo sapiens (Human))
University Of Michigan
LigandPNGBDBM92481(Sennoside A, G)
Affinity DataIC50:  5.10E+4nMpH: 7.8 T: 2°C. Assay description: Enzyme activity assay using human and murine PAI-1.
In DepthDetails ArticlePubMed
TargetReplicase polyprotein 1ab(2019-nCoV)
Fraunhofer Institute For Translational Medicine And Pharmacology (Itmp) And Fraunhofer Cluster Of Excellence For Immune Mediated Diseases (Cimd
LigandPNGBDBM92481(Sennoside A, G)
Affinity DataIC50:  650nM. Assay description: Primary assay principle based on quenched FRET peptide substrate of SARS-CoV-2 3CL-Pro (lhs). Inhibiting compounds reduce fluorescence signal relativ...
In DepthDetails Article
TargetReplicase polyprotein 1ab(2019-nCoV)
Fraunhofer Institute For Translational Medicine And Pharmacology (Itmp) And Fraunhofer Cluster Of Excellence For Immune Mediated Diseases (Cimd
LigandPNGBDBM92481(Sennoside A, G)
Affinity DataIC50:  1.59E+3nM. Assay description: Primary assay principle based on quenched FRET peptide substrate of SARS-CoV-2 3CL-Pro (lhs). Inhibiting compounds reduce fluorescence signal relativ...
In DepthDetails Article