BDBM92708 Photoaffinity ligand, 5
SMILES Clc1cc2Oc3cc(Cl)c(Cl)c(CNC(=O)c4cc(ccc4N(=O)=O)N=[N]#N)c3Oc2cc1Cl
InChI Key InChIKey=SDRYSLLVKJJRLJ-UHFFFAOYSA-N
Data  1 Kd
  Tab Delimited (TSV)   2D SDfile   Computed 3D by Vconf -m prep SDfile
Find this compound or compounds like it in BindingDB:
Activity Spreadsheet -- Enzyme Inhibition Constant Data from BindingDB
Found 1 hit for monomerid = 92708
TargetAryl hydrocarbon receptor(Mus musculus (Mouse))
University Of Wisconsin
LigandPNGBDBM92708(Photoaffinity ligand, 5)
Affinity DataKd:  13nMpH: 7.5 T: 2°C. Assay description: The equilibrium dissocation constants, KD values for the photoaffinity ligands were determined by a competitive binding assay.
Ligand InfoKEGGPC cidPC sid
In DepthDetails PubMed