BDBM93746 5-(4-Fluoro-phenyl)-2-thiophen-2-yl-oxazole::5-(4-fluorophenyl)-2-(2-thienyl)oxazole::5-(4-fluorophenyl)-2-thiophen-2-yl-1,3-oxazole::5-(4-fluorophenyl)-2-thiophen-2-yloxazole::MLS000067740::SMR000122314::cid_856373
SMILES Fc1ccc(cc1)-c1cnc(o1)-c1cccs1
InChI Key InChIKey=CRICFIBKOMWSAE-UHFFFAOYSA-N
Data  2 IC50
  Tab Delimited (TSV)   2D SDfile   Computed 3D by Vconf -m prep SDfile
Find this compound or compounds like it in BindingDB:
Activity Spreadsheet -- Enzyme Inhibition Constant Data from BindingDB
Found 2 hits for monomerid = 93746
TargetHeat shock protein hsp-16.2(Caenorhabditis elegans)
Burnham Center For Chemical Genomics
Curated by PubChem BioAssay
LigandPNGBDBM93746(5-(4-Fluoro-phenyl)-2-thiophen-2-yl-oxazole | 5-(4...)
Affinity DataIC50: >6.40E+4nM
In DepthDetails PCBioAssay
TargetProtein skinhead-1(Caenorhabditis elegans)
Burnham Center For Chemical Genomics
Curated by PubChem BioAssay
LigandPNGBDBM93746(5-(4-Fluoro-phenyl)-2-thiophen-2-yl-oxazole | 5-(4...)
Affinity DataIC50:  2.75E+4nM
In DepthDetails PCBioAssay