BDBM93767 3-ethoxy-2-propyl-N-[4-(trifluoromethoxy)benzyl]indazole-6-carboxamide::3-ethoxy-2-propyl-N-[[4-(trifluoromethoxy)phenyl]methyl]-6-indazolecarboxamide::3-ethoxy-2-propyl-N-[[4-(trifluoromethoxy)phenyl]methyl]indazole-6-carboxamide::3-ethoxy-2-propyl-N-[[4-(trifluoromethyloxy)phenyl]methyl]indazole-6-carboxamide::MLS000515493::SMR000156399::cid_11958432
SMILES CCCn1nc2cc(ccc2c1OCC)C(=O)NCc1ccc(OC(F)(F)F)cc1
InChI Key InChIKey=KGVHEGWVNMILOY-UHFFFAOYSA-N
Data  2 IC50
  Tab Delimited (TSV)   2D SDfile   Computed 3D by Vconf -m prep SDfile
Find this compound or compounds like it in BindingDB:
Activity Spreadsheet -- Enzyme Inhibition Constant Data from BindingDB
Found 2 hits for monomerid = 93767
TargetHeat shock protein hsp-16.2(Caenorhabditis elegans)
Burnham Center For Chemical Genomics
Curated by PubChem BioAssay
LigandPNGBDBM93767(3-ethoxy-2-propyl-N-[4-(trifluoromethoxy)benzyl]in...)
Affinity DataIC50: >6.40E+4nM
In DepthDetails PCBioAssay
TargetProtein skinhead-1(Caenorhabditis elegans)
Burnham Center For Chemical Genomics
Curated by PubChem BioAssay
LigandPNGBDBM93767(3-ethoxy-2-propyl-N-[4-(trifluoromethoxy)benzyl]in...)
Affinity DataIC50:  2.54E+4nM
In DepthDetails PCBioAssay