BDBM93834 4-[(4-fluorobenzyl)thio]quinazoline::4-[(4-fluorophenyl)methylsulfanyl]quinazoline::4-[(4-fluorophenyl)methylthio]quinazoline::MLS000684751::SMR000323266::cid_6710525
SMILES Fc1ccc(CSc2ncnc3ccccc23)cc1
InChI Key InChIKey=SSGAZDFIYFJSCX-UHFFFAOYSA-N
Data  2 IC50
  Tab Delimited (TSV)   2D SDfile   Computed 3D by Vconf -m prep SDfile
Find this compound or compounds like it in BindingDB:
Activity Spreadsheet -- Enzyme Inhibition Constant Data from BindingDB
Found 2 hits for monomerid = 93834
TargetHeat shock protein hsp-16.2(Caenorhabditis elegans)
Burnham Center For Chemical Genomics
Curated by PubChem BioAssay
LigandPNGBDBM93834(4-[(4-fluorobenzyl)thio]quinazoline | 4-[(4-fluoro...)
Affinity DataIC50: >6.40E+4nM
In DepthDetails PCBioAssay
TargetProtein skinhead-1(Caenorhabditis elegans)
Burnham Center For Chemical Genomics
Curated by PubChem BioAssay
LigandPNGBDBM93834(4-[(4-fluorobenzyl)thio]quinazoline | 4-[(4-fluoro...)
Affinity DataIC50:  2.42E+4nM
In DepthDetails PCBioAssay