BDBM93923 1-[4-(4-nitrobenzyl)oxybenzyl]pyrrolidine::1-[[4-[(4-nitrophenyl)methoxy]phenyl]methyl]pyrrolidine::MLS002699545::SMR001563458::cid_45280873
SMILES [O-][N+](=O)c1ccc(COc2ccc(CN3CCCC3)cc2)cc1
InChI Key InChIKey=YRFSUOQVFITONK-UHFFFAOYSA-N
Data  2 IC50
  Tab Delimited (TSV)   2D SDfile   Computed 3D by Vconf -m prep SDfile
Find this compound or compounds like it in BindingDB:
Activity Spreadsheet -- Enzyme Inhibition Constant Data from BindingDB
Found 2 hits for monomerid = 93923
TargetHeat shock protein hsp-16.2(Caenorhabditis elegans)
Burnham Center For Chemical Genomics
Curated by PubChem BioAssay
LigandPNGBDBM93923(1-[4-(4-nitrobenzyl)oxybenzyl]pyrrolidine | 1-[[4-...)
Affinity DataIC50: >6.40E+4nM
In DepthDetails PCBioAssay
TargetProtein skinhead-1(Caenorhabditis elegans)
Burnham Center For Chemical Genomics
Curated by PubChem BioAssay
LigandPNGBDBM93923(1-[4-(4-nitrobenzyl)oxybenzyl]pyrrolidine | 1-[[4-...)
Affinity DataIC50:  8.62E+3nM
In DepthDetails PCBioAssay