BDBM93955 MLS000103529::N-(4-acetamidophenyl)-3,5,6-trimethyl-1-benzofuran-2-carboxamide::N-(4-acetamidophenyl)-3,5,6-trimethyl-2-benzofurancarboxamide::N-(4-acetamidophenyl)-3,5,6-trimethyl-coumarilamide::SMR000017358::cid_975543
SMILES CC(=O)Nc1ccc(NC(=O)c2oc3cc(C)c(C)cc3c2C)cc1
InChI Key InChIKey=HQVXNHKMAGIJNN-UHFFFAOYSA-N
Data  1 IC50
  Tab Delimited (TSV)   2D SDfile   Computed 3D by Vconf -m prep SDfile
Find this compound or compounds like it in BindingDB:
Activity Spreadsheet -- Enzyme Inhibition Constant Data from BindingDB
Found 1 hit for monomerid = 93955
TargetEndothelial PAS domain-containing protein 1(Homo sapiens (Human))
Burnham Center For Chemical Genomics
Curated by PubChem BioAssay
LigandPNGBDBM93955(MLS000103529 | N-(4-acetamidophenyl)-3,5,6-trimeth...)
Affinity DataIC50:  1.64E+3nM
In DepthDetails PCBioAssay