BDBM94230 (5-methyl-3-phenyl-1,2-oxazol-4-yl)-pyrrolidin-1-yl-methanone::(5-methyl-3-phenyl-1,2-oxazol-4-yl)-pyrrolidin-1-ylmethanone::(5-methyl-3-phenyl-4-isoxazolyl)-(1-pyrrolidinyl)methanone::(5-methyl-3-phenyl-isoxazol-4-yl)-pyrrolidino-methanone::MLS001097783::SMR000714759::cid_822394
SMILES Cc1onc(c1C(=O)N1CCCC1)-c1ccccc1
InChI Key InChIKey=MXNDTLMGVMFZSU-UHFFFAOYSA-N
Data  1 IC50
  Tab Delimited (TSV)   2D SDfile   Computed 3D by Vconf -m prep SDfile
Find this compound or compounds like it in BindingDB:
Activity Spreadsheet -- Enzyme Inhibition Constant Data from BindingDB
Found 1 hit for monomerid = 94230
TargetNeuropilin-1(Homo sapiens (Human))
Burnham Center For Chemical Genomics
Curated by PubChem BioAssay
LigandPNGBDBM94230((5-methyl-3-phenyl-1,2-oxazol-4-yl)-pyrrolidin-1-y...)
Affinity DataIC50: >9.50E+4nM
In DepthDetails PCBioAssay