BDBM94231 1-(2,4-dichlorophenyl)-3-[2-(3-methoxyphenoxy)ethanoylamino]thiourea::1-(2,4-dichlorophenyl)-3-[[2-(3-methoxyphenoxy)-1-oxoethyl]amino]thiourea::1-(2,4-dichlorophenyl)-3-[[2-(3-methoxyphenoxy)acetyl]amino]thiourea::MLS000662129::N-(2,4-dichlorophenyl)-2-[(3-methoxyphenoxy)acetyl]hydrazinecarbothioamide::SMR000294039::cid_1295844
SMILES COc1cccc(OCC(=O)NNC(=S)Nc2ccc(Cl)cc2Cl)c1
InChI Key InChIKey=SYZQQPAJYFWRJA-UHFFFAOYSA-N
Data  1 IC50
  Tab Delimited (TSV)   2D SDfile   Computed 3D by Vconf -m prep SDfile
Find this compound or compounds like it in BindingDB:
Activity Spreadsheet -- Enzyme Inhibition Constant Data from BindingDB
Found 1 hit for monomerid = 94231
TargetNeuropilin-1(Homo sapiens (Human))
Burnham Center For Chemical Genomics
Curated by PubChem BioAssay
LigandPNGBDBM94231(1-(2,4-dichlorophenyl)-3-[2-(3-methoxyphenoxy)etha...)
Affinity DataIC50: >9.50E+4nM
In DepthDetails PCBioAssay