BDBM94500 (E)-2-butenedioic acid;1-[2-(dimethylamino)ethylamino]-2-methoxy-4-methyl-9-thioxanthenone::(E)-but-2-enedioic acid;1-[2-(dimethylamino)ethylamino]-2-methoxy-4-methyl-thioxanthen-9-one::(E)-but-2-enedioic acid;1-[2-(dimethylamino)ethylamino]-2-methoxy-4-methylthioxanthen-9-one::1-[2-(dimethylamino)ethylamino]-2-methoxy-4-methyl-thioxanthen-9-one;fumaric acid::MLS003116011::SMR001831569::cid_5384288
SMILES COc1cc(C)c2sc3ccccc3c(=O)c2c1NCCN(C)C
InChI Key InChIKey=NNLKMQJWJGRZDP-UHFFFAOYSA-N
Data  4 IC50
  Tab Delimited (TSV)   2D SDfile   Computed 3D by Vconf -m prep SDfile
Find this compound or compounds like it in BindingDB:
Activity Spreadsheet -- Enzyme Inhibition Constant Data from BindingDB
Found 4 hits for monomerid = 94500
TargetHepatocyte nuclear factor 4-alpha(Homo sapiens (Human))
The Scripps Research Institute Molecular Screening Center
Curated by PubChem BioAssay
LigandPNGBDBM94500((E)-2-butenedioic acid;1-[2-(dimethylamino)ethylam...)
Affinity DataIC50:  3.61E+4nM
In DepthDetails PCBioAssay
TargetPerilipin-5(Homo sapiens (Human))
The Scripps Research Institute Molecular Screening Center
Curated by PubChem BioAssay
LigandPNGBDBM94500((E)-2-butenedioic acid;1-[2-(dimethylamino)ethylam...)
Affinity DataIC50:  3.84E+3nM
In DepthDetails PCBioAssay
TargetPerilipin-1(Homo sapiens (Human))
The Scripps Research Institute Molecular Screening Center
Curated by PubChem BioAssay
LigandPNGBDBM94500((E)-2-butenedioic acid;1-[2-(dimethylamino)ethylam...)
Affinity DataIC50:  6.30E+3nM
In DepthDetails PCBioAssay
TargetPerilipin-5(Homo sapiens (Human))
The Scripps Research Institute Molecular Screening Center
Curated by PubChem BioAssay
LigandPNGBDBM94500((E)-2-butenedioic acid;1-[2-(dimethylamino)ethylam...)
Affinity DataIC50:  3.94E+3nM
In DepthDetails PCBioAssay