BDBM94642 MLS002639224::SMR001548671::cid_231714
SMILES CC(=O)Oc1ccc(cc1)C12c3ccccc3C1(OC(C)=O)c1cc(OC(C)=O)ccc21
InChI Key InChIKey=VYVDPFREHHCGMM-UHFFFAOYSA-N
Data  3 IC50
  Tab Delimited (TSV)   2D SDfile   Computed 3D by Vconf -m prep SDfile
Find this compound or compounds like it in BindingDB:
Activity Spreadsheet -- Enzyme Inhibition Constant Data from BindingDB
Found 3 hits for monomerid = 94642
TargetHepatocyte nuclear factor 4-alpha(Homo sapiens (Human))
The Scripps Research Institute Molecular Screening Center
Curated by PubChem BioAssay
LigandPNGBDBM94642(MLS002639224 | SMR001548671 | cid_231714)
Affinity DataIC50:  5.50E+3nM
Ligand InfoPC cidPC sid
In DepthDetails PCBioAssay
TargetPerilipin-5(Homo sapiens (Human))
The Scripps Research Institute Molecular Screening Center
Curated by PubChem BioAssay
LigandPNGBDBM94642(MLS002639224 | SMR001548671 | cid_231714)
Affinity DataIC50:  720nM
Ligand InfoPC cidPC sid
In DepthDetails PCBioAssay
TargetPerilipin-1(Homo sapiens (Human))
The Scripps Research Institute Molecular Screening Center
Curated by PubChem BioAssay
LigandPNGBDBM94642(MLS002639224 | SMR001548671 | cid_231714)
Affinity DataIC50:  581nM
Ligand InfoPC cidPC sid
In DepthDetails PCBioAssay