BDBM94643 1-(3,4-dichlorophenyl)-2-(2-imino-3-prop-2-enyl-1-benzimidazolyl)ethanone;hydrobromide::1-(3,4-dichlorophenyl)-2-(2-imino-3-prop-2-enylbenzimidazol-1-yl)ethanone;hydrobromide::2-(2-azanylidene-3-prop-2-enyl-benzimidazol-1-yl)-1-(3,4-dichlorophenyl)ethanone;hydrobromide::2-(3-allyl-2-imino-benzimidazol-1-yl)-1-(3,4-dichlorophenyl)ethanone;hydrobromide::MLS-0471928.0001::cid_2881199
SMILES Clc1ccc(cc1Cl)C(=O)Cn1c2ccccc2n(CC=C)c1=N
InChI Key InChIKey=ZIIOAFDYCXGOSJ-UHFFFAOYSA-N
Data  1 EC50
  Tab Delimited (TSV)   2D SDfile   Computed 3D by Vconf -m prep SDfile
Find this compound or compounds like it in BindingDB:
Activity Spreadsheet -- Enzyme Inhibition Constant Data from BindingDB
Found 1 hit for monomerid = 94643
TargetXylosyl- and glucuronyltransferase LARGE1(Homo sapiens (Human))
Burnham Center For Chemical Genomics
Curated by PubChem BioAssay
LigandPNGBDBM94643(1-(3,4-dichlorophenyl)-2-(2-imino-3-prop-2-enyl-1-...)
Affinity DataEC50:  3.33E+4nM
In DepthDetails PCBioAssay