BDBM94686 MLS000687260::N'-[(E)-(4-benzoxybenzylidene)amino]-N-(4-pyridylmethyl)oxamide::N'-[(E)-(4-phenylmethoxyphenyl)methylideneamino]-N-(pyridin-4-ylmethyl)ethanediamide::N'-[(E)-(4-phenylmethoxyphenyl)methylideneamino]-N-(pyridin-4-ylmethyl)oxamide::SMR000283966::cid_9593463
SMILES O=C(NCc1ccncc1)C(=O)N\N=C\c1ccc(OCc2ccccc2)cc1
InChI Key InChIKey=OECNKPDSAHULIW-MFKUBSTISA-N
Data  1 IC50
  Tab Delimited (TSV)   2D SDfile   Computed 3D by Vconf -m prep SDfile
Find this compound or compounds like it in BindingDB:
Activity Spreadsheet -- Enzyme Inhibition Constant Data from BindingDB
Found 1 hit for monomerid = 94686
TargetADP-ribosylation factor GTPase-activating protein 1(Rattus norvegicus)
The Scripps Research Institute Molecular Screening Center
Curated by PubChem BioAssay
LigandPNGBDBM94686(MLS000687260 | N'-[(E)-(4-benzoxybenzylidene)amino...)
Affinity DataIC50:  1.03E+4nM
In DepthDetails PCBioAssay