BDBM94732 (E)-3-[4-(2-chloro-6-fluoro-benzyl)oxyphenyl]-N-[3-(dimethylamino)propyl]acrylamide::(E)-3-[4-[(2-chloranyl-6-fluoranyl-phenyl)methoxy]phenyl]-N-[3-(dimethylamino)propyl]prop-2-enamide::(E)-3-[4-[(2-chloro-6-fluorophenyl)methoxy]phenyl]-N-[3-(dimethylamino)propyl]-2-propenamide::(E)-3-[4-[(2-chloro-6-fluorophenyl)methoxy]phenyl]-N-[3-(dimethylamino)propyl]prop-2-enamide::(E)-3-{4-[(2-chloro-6-fluorobenzyl)oxy]phenyl}-N-[3-(dimethylamino)propyl]-2-propenamide::MLS000721223::SMR000335657::cid_5914949
SMILES CN(C)CCCNC(=O)\C=C\c1ccc(OCc2c(F)cccc2Cl)cc1
InChI Key InChIKey=ZZJOTYVKOBLDMI-FMIVXFBMSA-N
Data  1 EC50
  Tab Delimited (TSV)   2D SDfile   Computed 3D by Vconf -m prep SDfile
Find this compound or compounds like it in BindingDB:
Activity Spreadsheet -- Enzyme Inhibition Constant Data from BindingDB
Found 1 hit for monomerid = 94732
TargetXylosyl- and glucuronyltransferase LARGE1(Homo sapiens (Human))
Burnham Center For Chemical Genomics
Curated by PubChem BioAssay
LigandPNGBDBM94732((E)-3-[4-(2-chloro-6-fluoro-benzyl)oxyphenyl]-N-[3...)
Affinity DataEC50:  9.37E+3nM
In DepthDetails PCBioAssay