BDBM94742 4-(cycloheptylamino)-N-[3-(dimethylamino)propyl]-3-nitro-benzenesulfonamide::4-(cycloheptylamino)-N-[3-(dimethylamino)propyl]-3-nitrobenzenesulfonamide::MLS001171655::SMR000594945::cid_4850082
SMILES CN(C)CCCNS(=O)(=O)c1ccc(NC2CCCCCC2)c(c1)[N+]([O-])=O
InChI Key InChIKey=HYVZDOGMSWPIJR-UHFFFAOYSA-N
Data  1 EC50
  Tab Delimited (TSV)   2D SDfile   Computed 3D by Vconf -m prep SDfile
Find this compound or compounds like it in BindingDB:
Activity Spreadsheet -- Enzyme Inhibition Constant Data from BindingDB
Found 1 hit for monomerid = 94742
TargetXylosyl- and glucuronyltransferase LARGE1(Homo sapiens (Human))
Burnham Center For Chemical Genomics
Curated by PubChem BioAssay
LigandPNGBDBM94742(4-(cycloheptylamino)-N-[3-(dimethylamino)propyl]-3...)
Affinity DataEC50:  6.11E+3nM
In DepthDetails PCBioAssay