BDBM94761 3-[1-benzothiophen-2-ylmethyl(methyl)amino]-2-ethyl-N-[1-(phenylmethyl)-4-piperidinyl]-6-imidazo[1,2-a]pyridinecarboxamide::3-[1-benzothiophen-2-ylmethyl(methyl)amino]-2-ethyl-N-[1-(phenylmethyl)piperidin-4-yl]imidazo[1,2-a]pyridine-6-carboxamide::3-[1-benzothiophen-2-ylmethyl(methyl)amino]-N-(1-benzylpiperidin-4-yl)-2-ethylimidazo[1,2-a]pyridine-6-carboxamide::3-[benzothiophen-2-ylmethyl(methyl)amino]-N-(1-benzyl-4-piperidyl)-2-ethyl-imidazo[1,2-a]pyridine-6-carboxamide::MLS003121236::SMR001283653::cid_46942685
SMILES CCc1nc2ccc(cn2c1N(C)Cc1cc2ccccc2s1)C(=O)NC1CCN(Cc2ccccc2)CC1
InChI Key InChIKey=QCPKDNFHSPNEEC-UHFFFAOYSA-N
Data  1 EC50
  Tab Delimited (TSV)   2D SDfile   Computed 3D by Vconf -m prep SDfile
Find this compound or compounds like it in BindingDB:
Activity Spreadsheet -- Enzyme Inhibition Constant Data from BindingDB
Found 1 hit for monomerid = 94761
TargetXylosyl- and glucuronyltransferase LARGE1(Homo sapiens (Human))
Burnham Center For Chemical Genomics
Curated by PubChem BioAssay
LigandPNGBDBM94761(3-[1-benzothiophen-2-ylmethyl(methyl)amino]-2-ethy...)
Affinity DataEC50:  6.07E+3nM
Ligand InfoPC cidPC sid
In DepthDetails PCBioAssay