BDBM94762 4-[1-amino-2-(4-chlorophenyl)ethyl]-N-(4-methylsulfonylphenyl)-1,3-thiazol-2-amine::4-[1-amino-2-(4-chlorophenyl)ethyl]-N-(4-methylsulfonylphenyl)-2-thiazolamine::4-[1-azanyl-2-(4-chlorophenyl)ethyl]-N-(4-methylsulfonylphenyl)-1,3-thiazol-2-amine::MLS003123770::SMR001291831::[4-[1-amino-2-(4-chlorophenyl)ethyl]thiazol-2-yl]-(4-mesylphenyl)amine::cid_46942717
SMILES CS(=O)(=O)c1ccc(Nc2nc(cs2)C(N)Cc2ccc(Cl)cc2)cc1
InChI Key InChIKey=WEZNBSFIBAOAMA-UHFFFAOYSA-N
Data  1 EC50
  Tab Delimited (TSV)   2D SDfile   Computed 3D by Vconf -m prep SDfile
Find this compound or compounds like it in BindingDB:
Activity Spreadsheet -- Enzyme Inhibition Constant Data from BindingDB
Found 1 hit for monomerid = 94762
TargetXylosyl- and glucuronyltransferase LARGE1(Homo sapiens (Human))
Burnham Center For Chemical Genomics
Curated by PubChem BioAssay
LigandPNGBDBM94762(4-[1-amino-2-(4-chlorophenyl)ethyl]-N-(4-methylsul...)
Affinity DataEC50:  8.93E+3nM
In DepthDetails PCBioAssay