BDBM94857 6-amino-2-fluoro-9-fluorenone::6-amino-2-fluoro-fluoren-9-one::6-amino-2-fluorofluoren-9-one::6-azanyl-2-fluoranyl-fluoren-9-one::MLS002704007::SMR001570716::cid_267875
SMILES Nc1ccc2C(=O)c3cc(F)ccc3-c2c1
InChI Key InChIKey=AYSCNZVRTTWOHG-UHFFFAOYSA-N
Data  2 IC50
  Tab Delimited (TSV)   2D SDfile   Computed 3D by Vconf -m prep SDfile
Find this compound or compounds like it in BindingDB:
Activity Spreadsheet -- Enzyme Inhibition Constant Data from BindingDB
Found 2 hits for monomerid = 94857
TargetSentrin-specific protease 1(Homo sapiens (Human))
Burnham Center For Chemical Genomics
Curated by PubChem BioAssay
LigandPNGBDBM94857(6-amino-2-fluoro-9-fluorenone | 6-amino-2-fluoro-f...)
Affinity DataIC50:  7.69E+4nM
Ligand InfoPC cidPC sid
In DepthDetails PCBioAssay
TargetSentrin-specific protease 1(Homo sapiens (Human))
Burnham Center For Chemical Genomics
Curated by PubChem BioAssay
LigandPNGBDBM94857(6-amino-2-fluoro-9-fluorenone | 6-amino-2-fluoro-f...)
Affinity DataIC50:  1.94E+4nM
Ligand InfoPC cidPC sid
In DepthDetails PCBioAssay