BDBM94875 (E)-3-(5-fluoro-2-hydroxy-phenyl)acrylic acid ethyl ester::(E)-3-(5-fluoro-2-hydroxyphenyl)-2-propenoic acid ethyl ester::MLS003675179::SMR002355624::cid_23919060::ethyl (E)-3-(5-fluoranyl-2-oxidanyl-phenyl)prop-2-enoate::ethyl (E)-3-(5-fluoro-2-hydroxyphenyl)prop-2-enoate
SMILES CCOC(=O)\C=C\c1cc(F)ccc1O
InChI Key InChIKey=WPJUITWUKANQHJ-ZZXKWVIFSA-N
Data  2 IC50
  Tab Delimited (TSV)   2D SDfile   Computed 3D by Vconf -m prep SDfile
Find this compound or compounds like it in BindingDB:
Activity Spreadsheet -- Enzyme Inhibition Constant Data from BindingDB
Found 2 hits for monomerid = 94875
TargetSentrin-specific protease 1(Homo sapiens (Human))
Burnham Center For Chemical Genomics
Curated by PubChem BioAssay
LigandPNGBDBM94875((E)-3-(5-fluoro-2-hydroxy-phenyl)acrylic acid ethy...)
Affinity DataIC50:  1.38E+4nM
In DepthDetails PCBioAssay
TargetSentrin-specific protease 1(Homo sapiens (Human))
Burnham Center For Chemical Genomics
Curated by PubChem BioAssay
LigandPNGBDBM94875((E)-3-(5-fluoro-2-hydroxy-phenyl)acrylic acid ethy...)
Affinity DataIC50:  1.12E+4nM
In DepthDetails PCBioAssay