BDBM95193 4-methyl-N-[4-[(3-naphthalen-2-ylimidazo[1,2-a]pyrazin-8-yl)amino]phenyl]benzenesulfonamide::4-methyl-N-[4-[[3-(2-naphthalenyl)-8-imidazo[1,2-a]pyrazinyl]amino]phenyl]benzenesulfonamide::4-methyl-N-[4-[[3-(2-naphthyl)imidazo[1,2-a]pyrazin-8-yl]amino]phenyl]benzenesulfonamide::MLS003123239::SMR001454237::cid_46942474
SMILES Cc1ccc(cc1)S(=O)(=O)Nc1ccc(Nc2nccn3c(cnc23)-c2ccc3ccccc3c2)cc1
InChI Key InChIKey=MIHHWBVNJDEABA-UHFFFAOYSA-N
Data  1 IC50
  Tab Delimited (TSV)   2D SDfile   Computed 3D by Vconf -m prep SDfile
Find this compound or compounds like it in BindingDB:
Activity Spreadsheet -- Enzyme Inhibition Constant Data from BindingDB
Found 1 hit for monomerid = 95193
TargetProbable nicotinate-nucleotide adenylyltransferase(Staphylococcus aureus subsp. aureus N315)
Burnham Center For Chemical Genomics
Curated by PubChem BioAssay
LigandPNGBDBM95193(4-methyl-N-[4-[(3-naphthalen-2-ylimidazo[1,2-a]pyr...)
Affinity DataIC50:  1.63E+4nM
Ligand InfoPC cidPC sid
In DepthDetails PCBioAssay