BDBM95267 1-N-cyclopropyl-4-N-(2-methylcyclohexyl)-4-N-[(3,4,5-trimethoxyphenyl)methyl]benzene-1,4-disulfonamide::Benzene-1,4-disulfonic acid 1-cyclopropylamide 4-[(2-methyl-cyclohexyl)-(3,4,5-trimethoxy-benzyl)-amide]::MLS000548376::N-cyclopropyl-N'-(2-methylcyclohexyl)-N'-(3,4,5-trimethoxybenzyl)benzene-1,4-disulfonamide::N1-cyclopropyl-N4-(2-methylcyclohexyl)-N4-[(3,4,5-trimethoxyphenyl)methyl]benzene-1,4-disulfonamide::SMR000170977::cid_3189855
SMILES COc1cc(CN(C2CCCCC2C)S(=O)(=O)c2ccc(cc2)S(=O)(=O)NC2CC2)cc(OC)c1OC
InChI Key InChIKey=ASXZSKMSJHUJGG-UHFFFAOYSA-N
Data  3 IC50
  Tab Delimited (TSV)   2D SDfile   Computed 3D by Vconf -m prep SDfile
Find this compound or compounds like it in BindingDB:
Activity Spreadsheet -- Enzyme Inhibition Constant Data from BindingDB
Found 3 hits for monomerid = 95267
TargetEnvelope glycoprotein gp160(Human immunodeficiency virus type 1 group M subtyp...)
The Scripps Research Institute Molecular Screening Center
Curated by PubChem BioAssay
LigandPNGBDBM95267(1-N-cyclopropyl-4-N-(2-methylcyclohexyl)-4-N-[(3,4...)
Affinity DataIC50: >6.71E+4nM
In DepthDetails PCBioAssay
TargetEnvelope glycoprotein gp160(Human immunodeficiency virus type 1 group M subtyp...)
The Scripps Research Institute Molecular Screening Center
Curated by PubChem BioAssay
LigandPNGBDBM95267(1-N-cyclopropyl-4-N-(2-methylcyclohexyl)-4-N-[(3,4...)
Affinity DataIC50: >6.71E+4nM
In DepthDetails PCBioAssay
TargetEnvelope glycoprotein gp160(Human immunodeficiency virus type 1 group M subtyp...)
The Scripps Research Institute Molecular Screening Center
Curated by PubChem BioAssay
LigandPNGBDBM95267(1-N-cyclopropyl-4-N-(2-methylcyclohexyl)-4-N-[(3,4...)
Affinity DataIC50: >6.71E+4nM
In DepthDetails PCBioAssay