BDBM95801 (12aS)-2-methyl-6-(3-nitrophenyl)-6,7,12,12a-tetrahydro-3H-pyrazino[1,2-b]-carboline-1,4-quinone::MLS001164854::SMR000540129::cid_16398776
SMILES CN1CC(=O)N2[C@@H](Cc3c([nH]c4ccccc34)C2c2cccc(c2)[N+]([O-])=O)C1=O
InChI Key InChIKey=ZNANMCXUAVZKKP-DIMJTDRSSA-N
Data  1 IC50
  Tab Delimited (TSV)   2D SDfile   Computed 3D by Vconf -m prep SDfile
Find this compound or compounds like it in BindingDB:
Activity Spreadsheet -- Enzyme Inhibition Constant Data from BindingDB
Found 1 hit for monomerid = 95801
TargetMethionine--tRNA ligase(Trypanosoma brucei brucei strain 927/4 GUTat10.1)
The Scripps Research Institute Molecular Screening Center
Curated by PubChem BioAssay
LigandPNGBDBM95801((12aS)-2-methyl-6-(3-nitrophenyl)-6,7,12,12a-tetra...)
Affinity DataIC50:  393nM
In DepthDetails PCBioAssay