BDBM95831 MLS001079903::N-[2-(4-chloroanilino)-2-keto-ethyl]-N-methyl-3-nitro-4-(1,2,4-triazol-1-yl)benzamide::N-[2-(4-chloroanilino)-2-oxoethyl]-N-methyl-3-nitro-4-(1,2,4-triazol-1-yl)benzamide::N-[2-[(4-chlorophenyl)amino]-2-oxidanylidene-ethyl]-N-methyl-3-nitro-4-(1,2,4-triazol-1-yl)benzamide::SMR000709923::cid_24979155
SMILES CN(CC(=O)Nc1ccc(Cl)cc1)C(=O)c1ccc(c(c1)[N+]([O-])=O)-n1cncn1
InChI Key InChIKey=IEYZBMWDBIBKCE-UHFFFAOYSA-N
Data  1 IC50
  Tab Delimited (TSV)   2D SDfile   Computed 3D by Vconf -m prep SDfile
Find this compound or compounds like it in BindingDB:
Activity Spreadsheet -- Enzyme Inhibition Constant Data from BindingDB
Found 1 hit for monomerid = 95831
TargetMethionine--tRNA ligase(Trypanosoma brucei brucei strain 927/4 GUTat10.1)
The Scripps Research Institute Molecular Screening Center
Curated by PubChem BioAssay
LigandPNGBDBM95831(MLS001079903 | N-[2-(4-chloroanilino)-2-keto-ethyl...)
Affinity DataIC50:  1.18E+3nM
In DepthDetails PCBioAssay