BDBM96114 4-(1-prop-2-enyl-2-benzimidazolyl)aniline::4-(1-prop-2-enylbenzimidazol-2-yl)aniline::MLS000103089::SMR000015636::[4-(1-allylbenzimidazol-2-yl)phenyl]amine::cid_752358
SMILES Nc1ccc(cc1)-c1nc2ccccc2n1CC=C
InChI Key InChIKey=MTCODPVHMGBXRD-UHFFFAOYSA-N
Data  1 IC50
  Tab Delimited (TSV)   2D SDfile   Computed 3D by Vconf -m prep SDfile
Find this compound or compounds like it in BindingDB:
Activity Spreadsheet -- Enzyme Inhibition Constant Data from BindingDB
Found 1 hit for monomerid = 96114
TargetFructose-bisphosphate aldolase(Mycobacterium tuberculosis (strain H37Rv))
The Scripps Research Institute Molecular Screening Center
Curated by PubChem BioAssay
LigandPNGBDBM96114(4-(1-prop-2-enyl-2-benzimidazolyl)aniline | 4-(1-p...)
Affinity DataIC50: >370nM
In DepthDetails PCBioAssay