BDBM96124 5-[(E)-2-(2-Chloro-phenyl)-vinyl]-[1,3,4]thiadiazol-2-ylamine::5-[(E)-2-(2-chlorophenyl)ethenyl]-1,3,4-thiadiazol-2-amine::MLS000780243::SMR000420426::[5-[(E)-2-(2-chlorophenyl)vinyl]-1,3,4-thiadiazol-2-yl]amine::cid_5346752
SMILES Nc1nnc(\C=C\c2ccccc2Cl)s1
InChI Key InChIKey=YPGMOJZDPBVHJE-AATRIKPKSA-N
Data  1 IC50
  Tab Delimited (TSV)   2D SDfile   Computed 3D by Vconf -m prep SDfile
Find this compound or compounds like it in BindingDB:
Activity Spreadsheet -- Enzyme Inhibition Constant Data from BindingDB
Found 1 hit for monomerid = 96124
TargetFructose-bisphosphate aldolase(Mycobacterium tuberculosis (strain H37Rv))
The Scripps Research Institute Molecular Screening Center
Curated by PubChem BioAssay
LigandPNGBDBM96124(5-[(E)-2-(2-Chloro-phenyl)-vinyl]-[1,3,4]thiadiazo...)
Affinity DataIC50:  1.59E+3nM
In DepthDetails PCBioAssay