BDBM96138 4-[(6-methoxyfuro[2,3-b]quinoline-2-carbonyl)amino]piperidine-1-carboxylic acid ethyl ester::4-[[(6-methoxy-2-furo[2,3-b]quinolinyl)-oxomethyl]amino]-1-piperidinecarboxylic acid ethyl ester::MLS000091909::SMR000026433::cid_3239341::ethyl 4-[(6-methoxyfuro[2,3-b]quinolin-2-yl)carbonylamino]piperidine-1-carboxylate::ethyl 4-[(6-methoxyfuro[2,3-b]quinoline-2-carbonyl)amino]piperidine-1-carboxylate::ethyl 4-{[(6-methoxyfuro[2,3-b]quinolin-2-yl)carbonyl]amino}piperidine-1-carboxylate
SMILES CCOC(=O)N1CCC(CC1)NC(=O)c1cc2cc3cc(OC)ccc3nc2o1
InChI Key InChIKey=AIUSZXKSILRDIB-UHFFFAOYSA-N
Data  1 IC50
  Tab Delimited (TSV)   2D SDfile   Computed 3D by Vconf -m prep SDfile
Find this compound or compounds like it in BindingDB:
Activity Spreadsheet -- Enzyme Inhibition Constant Data from BindingDB
Found 1 hit for monomerid = 96138
TargetFructose-bisphosphate aldolase(Mycobacterium tuberculosis (strain H37Rv))
The Scripps Research Institute Molecular Screening Center
Curated by PubChem BioAssay
LigandPNGBDBM96138(4-[(6-methoxyfuro[2,3-b]quinoline-2-carbonyl)amino...)
Affinity DataIC50: >370nM
In DepthDetails PCBioAssay