BDBM96145 (+)-trans-ethyl-khellactone::(9S,10R)-10-ethoxy-8,8-dimethyl-9-oxidanyl-9,10-dihydropyrano[2,3-f]chromen-2-one::(9S,10R)-10-ethoxy-9-hydroxy-8,8-dimethyl-9,10-dihydropyrano[2,3-f][1]benzopyran-2-one::(9S,10R)-10-ethoxy-9-hydroxy-8,8-dimethyl-9,10-dihydropyrano[2,3-f]chromen-2-one::MLS002472917::SMR001397028::cid_44144312
SMILES CCO[C@H]1[C@H](O)C(C)(C)Oc2ccc3ccc(=O)oc3c12
InChI Key InChIKey=UCLKQWHJVUDTFJ-CABCVRRESA-N
Data  1 IC50
  Tab Delimited (TSV)   2D SDfile   Computed 3D by Vconf -m prep SDfile
Find this compound or compounds like it in BindingDB:
Activity Spreadsheet -- Enzyme Inhibition Constant Data from BindingDB
Found 1 hit for monomerid = 96145
TargetFructose-bisphosphate aldolase(Mycobacterium tuberculosis (strain H37Rv))
The Scripps Research Institute Molecular Screening Center
Curated by PubChem BioAssay
LigandPNGBDBM96145((+)-trans-ethyl-khellactone | (9S,10R)-10-ethoxy-8...)
Affinity DataIC50: >1.11E+3nM
In DepthDetails PCBioAssay