BDBM96179 2-[4-(3-chlorophenyl)phenyl]-6-methyl-N-(phenylmethyl)-3-imidazo[1,2-a]pyridinamine;2,2,2-trifluoroacetic acid::2-[4-(3-chlorophenyl)phenyl]-6-methyl-N-(phenylmethyl)imidazo[1,2-a]pyridin-3-amine;2,2,2-tris(fluoranyl)ethanoic acid::MLS001066040::N-benzyl-2-[4-(3-chlorophenyl)phenyl]-6-methylimidazo[1,2-a]pyridin-3-amine;2,2,2-trifluoroacetic acid::SMR000814651::benzyl-[2-[4-(3-chlorophenyl)phenyl]-6-methyl-imidazo[1,2-a]pyridin-3-yl]amine;2,2,2-trifluoroacetic acid::cid_24891814
SMILES Cc1ccc2nc(c(NCc3ccccc3)n2c1)-c1ccc(cc1)-c1cccc(Cl)c1
InChI Key InChIKey=UTEKOLDCUWQOHD-UHFFFAOYSA-N
Data  1 IC50
  Tab Delimited (TSV)   2D SDfile   Computed 3D by Vconf -m prep SDfile
Find this compound or compounds like it in BindingDB:
Activity Spreadsheet -- Enzyme Inhibition Constant Data from BindingDB
Found 1 hit for monomerid = 96179
TargetFructose-bisphosphate aldolase(Mycobacterium tuberculosis (strain H37Rv))
The Scripps Research Institute Molecular Screening Center
Curated by PubChem BioAssay
LigandPNGBDBM96179(2-[4-(3-chlorophenyl)phenyl]-6-methyl-N-(phenylmet...)
Affinity DataIC50:  848nM
In DepthDetails PCBioAssay