BDBM96196 MLS001149852::N-(2-keto-4-methyl-chromen-7-yl)-2-phenyl-valeramide::N-(4-methyl-2-oxidanylidene-chromen-7-yl)-2-phenyl-pentanamide::N-(4-methyl-2-oxo-1-benzopyran-7-yl)-2-phenylpentanamide::N-(4-methyl-2-oxochromen-7-yl)-2-phenylpentanamide::SMR000688083::cid_16551195
SMILES CCCC(C(=O)Nc1ccc2c(C)cc(=O)oc2c1)c1ccccc1
InChI Key InChIKey=INFZUFVDGCQFKI-UHFFFAOYSA-N
Data  1 IC50
  Tab Delimited (TSV)   2D SDfile   Computed 3D by Vconf -m prep SDfile
Find this compound or compounds like it in BindingDB:
Activity Spreadsheet -- Enzyme Inhibition Constant Data from BindingDB
Found 1 hit for monomerid = 96196
TargetFructose-bisphosphate aldolase(Mycobacterium tuberculosis (strain H37Rv))
The Scripps Research Institute Molecular Screening Center
Curated by PubChem BioAssay
LigandPNGBDBM96196(MLS001149852 | N-(2-keto-4-methyl-chromen-7-yl)-2-...)
Affinity DataIC50:  1.23E+3nM
In DepthDetails PCBioAssay