BDBM96212 2-(4-methoxyphenyl)-N-(2-oxolanylmethyl)-6-propan-2-yl-4-quinolinecarboxamide::2-(4-methoxyphenyl)-N-(oxolan-2-ylmethyl)-6-propan-2-yl-quinoline-4-carboxamide::2-(4-methoxyphenyl)-N-(oxolan-2-ylmethyl)-6-propan-2-ylquinoline-4-carboxamide::6-isopropyl-2-(4-methoxyphenyl)-N-(tetrahydrofurfuryl)cinchoninamide::MLS001031153::SMR000634758::cid_4215737
SMILES COc1ccc(cc1)-c1cc(C(=O)NCC2CCCO2)c2cc(ccc2n1)C(C)C
InChI Key InChIKey=YWCFYJUATZTKSP-UHFFFAOYSA-N
Data  1 IC50
  Tab Delimited (TSV)   2D SDfile   Computed 3D by Vconf -m prep SDfile
Find this compound or compounds like it in BindingDB:
Activity Spreadsheet -- Enzyme Inhibition Constant Data from BindingDB
Found 1 hit for monomerid = 96212
TargetFructose-bisphosphate aldolase(Mycobacterium tuberculosis (strain H37Rv))
The Scripps Research Institute Molecular Screening Center
Curated by PubChem BioAssay
LigandPNGBDBM96212(2-(4-methoxyphenyl)-N-(2-oxolanylmethyl)-6-propan-...)
Affinity DataIC50:  797nM
Ligand InfoPC cidPC sid
In DepthDetails PCBioAssay