BDBM96214 (6E)-6-[(1-naphthalenylamino)methylidene]-1-cyclohexa-2,4-dienone::(6E)-6-[(1-naphthylamino)methylene]cyclohexa-2,4-dien-1-one::(6E)-6-[(naphthalen-1-ylamino)methylidene]cyclohexa-2,4-dien-1-one::2-(Naphthalen-1-yliminomethyl)-phenol::MLS001207287::SMR000514427::cid_5393978
SMILES Oc1ccccc1C=Nc1cccc2ccccc12
InChI Key InChIKey=SOJUPXWRMKYNLZ-UHFFFAOYSA-N
Data  1 IC50
  Tab Delimited (TSV)   2D SDfile   Computed 3D by Vconf -m prep SDfile
Find this compound or compounds like it in BindingDB:
Activity Spreadsheet -- Enzyme Inhibition Constant Data from BindingDB
Found 1 hit for monomerid = 96214
TargetFructose-bisphosphate aldolase(Mycobacterium tuberculosis (strain H37Rv))
The Scripps Research Institute Molecular Screening Center
Curated by PubChem BioAssay
LigandPNGBDBM96214((6E)-6-[(1-naphthalenylamino)methylidene]-1-cycloh...)
Affinity DataIC50: >3.33E+3nM
In DepthDetails PCBioAssay