BDBM96259 6-Methyl-nicotinic acid [1-(5-nitro-furan-2-yl)-meth-(Z)-ylidene]-hydrazide::6-methyl-N-[(Z)-(5-nitro-2-furanyl)methylideneamino]-3-pyridinecarboxamide::6-methyl-N-[(Z)-(5-nitro-2-furyl)methyleneamino]nicotinamide::6-methyl-N-[(Z)-(5-nitrofuran-2-yl)methylideneamino]pyridine-3-carboxamide::MLS000768060::SMR000431367::cid_5405088
SMILES Cc1ccc(cn1)C(=O)N\N=C/c1ccc(o1)[N+]([O-])=O
InChI Key InChIKey=KOGGCDDTQPBCTI-AUWJEWJLSA-N
Data  1 IC50
  Tab Delimited (TSV)   2D SDfile   Computed 3D by Vconf -m prep SDfile
Find this compound or compounds like it in BindingDB:
Activity Spreadsheet -- Enzyme Inhibition Constant Data from BindingDB
Found 1 hit for monomerid = 96259
TargetRecBCD enzyme subunit RecD(Escherichia coli str. K-12 substr. MG1655)
The Scripps Research Institute Molecular Screening Center
Curated by PubChem BioAssay
LigandPNGBDBM96259(6-Methyl-nicotinic acid [1-(5-nitro-furan-2-yl)-me...)
Affinity DataIC50: >3.95E+4nM
In DepthDetails PCBioAssay