BDBM96266 MLS001204199::N-[(4-Chloro-phenyl)-(8-hydroxy-quinolin-7-yl)-methyl]-acetamide::N-[(4-chlorophenyl)-(8-hydroxy-7-quinolinyl)methyl]acetamide::N-[(4-chlorophenyl)-(8-hydroxy-7-quinolyl)methyl]acetamide::N-[(4-chlorophenyl)-(8-hydroxyquinolin-7-yl)methyl]acetamide::N-[(4-chlorophenyl)-(8-oxidanylquinolin-7-yl)methyl]ethanamide::SMR000516878::cid_2871851
SMILES CC(=O)NC(c1ccc(Cl)cc1)c1ccc2cccnc2c1O
InChI Key InChIKey=IXRHAWQJTWGCCU-UHFFFAOYSA-N
Data  1 IC50
  Tab Delimited (TSV)   2D SDfile   Computed 3D by Vconf -m prep SDfile
Find this compound or compounds like it in BindingDB:
Activity Spreadsheet -- Enzyme Inhibition Constant Data from BindingDB
Found 1 hit for monomerid = 96266
TargetRecBCD enzyme subunit RecD(Escherichia coli str. K-12 substr. MG1655)
The Scripps Research Institute Molecular Screening Center
Curated by PubChem BioAssay
LigandPNGBDBM96266(MLS001204199 | N-[(4-Chloro-phenyl)-(8-hydroxy-qui...)
Affinity DataIC50:  6.99E+4nM
In DepthDetails PCBioAssay