BDBM96270 1-ethyl-6-fluoro-4-keto-7-(4-methylpiperazino)quinoline-3-carboxylic acid ethyl ester::1-ethyl-6-fluoro-7-(4-methyl-1-piperazinyl)-4-oxo-3-quinolinecarboxylic acid ethyl ester::MLS001202106::SMR000565056::cid_1068705::ethyl 1-ethyl-6-fluoranyl-7-(4-methylpiperazin-1-yl)-4-oxidanylidene-quinoline-3-carboxylate::ethyl 1-ethyl-6-fluoro-7-(4-methylpiperazin-1-yl)-4-oxo-1,4-dihydroquinoline-3-carboxylate::ethyl 1-ethyl-6-fluoro-7-(4-methylpiperazin-1-yl)-4-oxoquinoline-3-carboxylate
SMILES CCOC(=O)c1cn(CC)c2cc(N3CCN(C)CC3)c(F)cc2c1=O
InChI Key InChIKey=FEGDMGCSHVIWNR-UHFFFAOYSA-N
Data  1 IC50
  Tab Delimited (TSV)   2D SDfile   Computed 3D by Vconf -m prep SDfile
Find this compound or compounds like it in BindingDB:
Activity Spreadsheet -- Enzyme Inhibition Constant Data from BindingDB
Found 1 hit for monomerid = 96270
TargetRecBCD enzyme subunit RecD(Escherichia coli str. K-12 substr. MG1655)
The Scripps Research Institute Molecular Screening Center
Curated by PubChem BioAssay
LigandPNGBDBM96270(1-ethyl-6-fluoro-4-keto-7-(4-methylpiperazino)quin...)
Affinity DataIC50:  5.78E+4nM
In DepthDetails PCBioAssay