BDBM96338 MLS000687233::N-(acetamidocarbamothioyl)-4-methyl-benzamide::N-(acetamidocarbamothioyl)-4-methylbenzamide::N-(acetamidothiocarbamoyl)-4-methyl-benzamide::N-[(acetylhydrazo)-sulfanylidenemethyl]-4-methylbenzamide::SMR000283919::cid_1728275
SMILES CC(=O)NNC(=S)NC(=O)c1ccc(C)cc1
InChI Key InChIKey=VVJNXARBXQWUDH-UHFFFAOYSA-N
Data  2 IC50
  Tab Delimited (TSV)   2D SDfile   Computed 3D by Vconf -m prep SDfile
Find this compound or compounds like it in BindingDB:
Activity Spreadsheet -- Enzyme Inhibition Constant Data from BindingDB
Found 2 hits for monomerid = 96338
TargetAlbumin(Bos taurus)
The Scripps Research Institute Molecular Screening Center
Curated by PubChem BioAssay
LigandPNGBDBM96338(MLS000687233 | N-(acetamidocarbamothioyl)-4-methyl...)
Affinity DataIC50: >9.40E+4nM
In DepthDetails PCBioAssay
TargetT cell receptor alpha variable 4(Homo sapiens (Human))
The Scripps Research Institute Molecular Screening Center
Curated by PubChem BioAssay
LigandPNGBDBM96338(MLS000687233 | N-(acetamidocarbamothioyl)-4-methyl...)
Affinity DataIC50: >9.40E+4nM
In DepthDetails PCBioAssay