BDBM96800 1-pyrrolidinecarbodithioic acid [2-oxo-2-(2-phenylethylamino)ethyl] ester::MLS001098008::SMR000706992::[2-oxidanylidene-2-(2-phenylethylamino)ethyl] pyrrolidine-1-carbodithioate::[2-oxo-2-(2-phenylethylamino)ethyl] pyrrolidine-1-carbodithioate::cid_7607298::pyrrolidine-1-carbodithioic acid [2-keto-2-(phenethylamino)ethyl] ester
SMILES O=C(CSC(=S)N1CCCC1)NCCc1ccccc1
InChI Key InChIKey=NSZPRMOGTXQDSC-UHFFFAOYSA-N
Data  2 IC50  2 EC50
  Tab Delimited (TSV)   2D SDfile   Computed 3D by Vconf -m prep SDfile
Find this compound or compounds like it in BindingDB:
Activity Spreadsheet -- Enzyme Inhibition Constant Data from BindingDB
Found 4 hits for monomerid = 96800
TargetGuanine nucleotide-binding protein subunit alpha-15(Homo sapiens (Human))
The Scripps Research Institute Molecular Screening Center
Curated by PubChem BioAssay
LigandPNGBDBM96800(1-pyrrolidinecarbodithioic acid [2-oxo-2-(2-phenyl...)
Affinity DataEC50: >2.99E+4nM
In DepthDetails PCBioAssay
TargetGuanine nucleotide-binding protein subunit alpha-15(Homo sapiens (Human))
The Scripps Research Institute Molecular Screening Center
Curated by PubChem BioAssay
LigandPNGBDBM96800(1-pyrrolidinecarbodithioic acid [2-oxo-2-(2-phenyl...)
Affinity DataIC50: >2.99E+4nM
In DepthDetails PCBioAssay
TargetTrace amine-associated receptor 1(Homo sapiens (Human))
The Scripps Research Institute Molecular Screening Center
Curated by PubChem BioAssay
LigandPNGBDBM96800(1-pyrrolidinecarbodithioic acid [2-oxo-2-(2-phenyl...)
Affinity DataEC50:  1.96E+3nM
In DepthDetails PCBioAssay
TargetTrace amine-associated receptor 1(Homo sapiens (Human))
The Scripps Research Institute Molecular Screening Center
Curated by PubChem BioAssay
LigandPNGBDBM96800(1-pyrrolidinecarbodithioic acid [2-oxo-2-(2-phenyl...)
Affinity DataIC50:  1.19E+3nM
In DepthDetails PCBioAssay