BDBM9685 2-methylpropyl N-[(2S)-1-[(1S,3aR,6aS)-1-({1-[({[(S)-(dimethylcarbamoyl)(phenyl)methyl]carbamoyl}methyl)carbamoyl]-1-oxopentan-2-yl}carbamoyl)-5,5-dimethyl-octahydrocyclopenta[c]pyrrol-2-yl]-3,3-dimethyl-1-oxobutan-2-yl]carbamate::SCH446211 (SCH6) Analog 18
SMILES CCCC(NC(=O)[C@@H]1[C@H]2CC(C)(C)C[C@H]2CN1C(=O)[C@@H](NC(=O)OCC(C)C)C(C)(C)C)C(=O)C(=O)NCC(=O)N[C@H](C(=O)N(C)C)c1ccccc1
InChI Key InChIKey=PUQQQYPELOIWQD-DFGHWRBVSA-N
Data  1 KI
  Tab Delimited (TSV)   2D SDfile   Computed 3D by Vconf -m prep SDfile
Find this compound or compounds like it in BindingDB:
Activity Spreadsheet -- Enzyme Inhibition Constant Data from BindingDB
Found 1 hit for monomerid = 9685
TargetGenome polyprotein(Hepatitis C virus (HCV genotype 1a, isolate H))
Schering-Plough Research Institute
LigandPNGBDBM9685(2-methylpropyl N-[(2S)-1-[(1S,3aR,6aS)-1-({1-[({[(...)
Affinity DataKi:  15nM ΔG°:  -10.8kcal/molepH: 6.5 T: 2°C. Assay description: Proteolytic cleavage of the ester linkage between the Nva (L-norvaline) and the chromophore (PAP) was monitored for change in absorbance at 370 nm. I...
In DepthDetails ArticlePubMed