BDBM9690 SCH446211 (SCH6) Analog 23::tert-butyl N-[(2S)-1-[(1R,2S,5S)-2-({1-[({[(S)-(dimethylcarbamoyl)(phenyl)methyl]carbamoyl}methyl)carbamoyl]-5,5,5-trifluoro-1-oxopentan-2-yl}carbamoyl)-6,6-dimethyl-3-azabicyclo[3.1.0]hexan-3-yl]-3,3-dimethyl-1-oxobutan-2-yl]carbamate
SMILES CN(C)C(=O)[C@@H](NC(=O)CNC(=O)C(=O)C(CCC(F)(F)F)NC(=O)[C@@H]1[C@@H]2[C@H](CN1C(=O)[C@@H](NC(=O)OC(C)(C)C)C(C)(C)C)C2(C)C)c1ccccc1
InChI Key InChIKey=SYHBIJWOUCBHHI-SBHLPTFISA-N
Data  1 KI
  Tab Delimited (TSV)   2D SDfile   Computed 3D by Vconf -m prep SDfile
Find this compound or compounds like it in BindingDB:
Activity Spreadsheet -- Enzyme Inhibition Constant Data from BindingDB
Found 1 hit for monomerid = 9690
TargetGenome polyprotein(Hepatitis C virus (HCV genotype 1a, isolate H))
Schering-Plough Research Institute
LigandPNGBDBM9690(SCH446211 (SCH6) Analog 23 | tert-butyl N-[(2S)-1-...)
Affinity DataKi:  2nM ΔG°:  -12.1kcal/molepH: 6.5 T: 2°C. Assay description: Proteolytic cleavage of the ester linkage between the Nva (L-norvaline) and the chromophore (PAP) was monitored for change in absorbance at 370 nm. I...
In DepthDetails ArticlePubMed