BDBM96915 MLS000768946::N-[4-(2-{N'-[1-Pyridin-4-yl-meth-(E)-ylidene]-hydrazino}-thiazol-4-yl)-phenyl]-butyramide::N-[4-[2-[(2Z)-2-(pyridin-4-ylmethylidene)hydrazinyl]-1,3-thiazol-4-yl]phenyl]butanamide;hydrobromide::N-[4-[2-[(2Z)-2-(pyridin-4-ylmethylidene)hydrazinyl]-4-thiazolyl]phenyl]butanamide;hydrobromide::N-[4-[2-[(N'Z)-N'-(4-pyridylmethylene)hydrazino]thiazol-4-yl]phenyl]butyramide;hydrobromide::SMR000433680::cid_44655640
SMILES CCCC(=O)Nc1ccc(cc1)-c1csc(N=NCc2ccncc2)n1
InChI Key InChIKey=XSFBLHGGLUAISN-UHFFFAOYSA-N
Data  2 IC50  2 EC50
  Tab Delimited (TSV)   2D SDfile   Computed 3D by Vconf -m prep SDfile
Find this compound or compounds like it in BindingDB:
Activity Spreadsheet -- Enzyme Inhibition Constant Data from BindingDB
Found 4 hits for monomerid = 96915
TargetTrace amine-associated receptor 1(Homo sapiens (Human))
The Scripps Research Institute Molecular Screening Center
Curated by PubChem BioAssay
LigandPNGBDBM96915(MLS000768946 | N-[4-(2-{N'-[1-Pyridin-4-yl-met...)
Affinity DataEC50: >2.99E+4nM
Ligand InfoPC cidPC sid
In DepthDetails PCBioAssay
TargetTrace amine-associated receptor 1(Homo sapiens (Human))
The Scripps Research Institute Molecular Screening Center
Curated by PubChem BioAssay
LigandPNGBDBM96915(MLS000768946 | N-[4-(2-{N'-[1-Pyridin-4-yl-met...)
Affinity DataIC50:  9.30E+3nM
Ligand InfoPC cidPC sid
In DepthDetails PCBioAssay
TargetGuanine nucleotide-binding protein subunit alpha-15(Homo sapiens (Human))
The Scripps Research Institute Molecular Screening Center
Curated by PubChem BioAssay
LigandPNGBDBM96915(MLS000768946 | N-[4-(2-{N'-[1-Pyridin-4-yl-met...)
Affinity DataEC50: >2.99E+4nM
Ligand InfoPC cidPC sid
In DepthDetails PCBioAssay
TargetGuanine nucleotide-binding protein subunit alpha-15(Homo sapiens (Human))
The Scripps Research Institute Molecular Screening Center
Curated by PubChem BioAssay
LigandPNGBDBM96915(MLS000768946 | N-[4-(2-{N'-[1-Pyridin-4-yl-met...)
Affinity DataIC50: >2.99E+4nM
Ligand InfoPC cidPC sid
In DepthDetails PCBioAssay