BDBM96989 (2E,4E)-2-cyano-N-(2-methoxyethyl)-5-(2-nitrophenyl)penta-2,4-dienamide::MLS000516251::SMR000372865::cid_2368463
SMILES COCCNC(=O)C(=C\C=C\c1ccccc1[N+]([O-])=O)\C#N
InChI Key InChIKey=SYXDPWLXZPSSIM-RYSUZZKOSA-N
Data  1 EC50
  Tab Delimited (TSV)   2D SDfile   Computed 3D by Vconf -m prep SDfile
Find this compound or compounds like it in BindingDB:
Activity Spreadsheet -- Enzyme Inhibition Constant Data from BindingDB
Found 1 hit for monomerid = 96989
TargetProbable global transcription activator SNF2L2(Homo sapiens (Human))
The Scripps Research Institute Molecular Screening Center
Curated by PubChem BioAssay
LigandPNGBDBM96989((2E,4E)-2-cyano-N-(2-methoxyethyl)-5-(2-nitropheny...)
Affinity DataEC50:  9.11E+4nM
Ligand InfoPC cidPC sid
In DepthDetails PCBioAssay