BDBM97012 1-(2,4-difluorophenyl)-3-(2-furoylamino)thiourea::1-(2,4-difluorophenyl)-3-(furan-2-carbonylamino)thiourea::1-(2,4-difluorophenyl)-3-[[2-furanyl(oxo)methyl]amino]thiourea::1-[2,4-bis(fluoranyl)phenyl]-3-(furan-2-ylcarbonylamino)thiourea::MLS001035768::SMR000666324::cid_978078
SMILES Fc1ccc(NC(=S)NNC(=O)c2ccco2)c(F)c1
InChI Key InChIKey=RUAWKLJBMPEFSF-UHFFFAOYSA-N
Data  1 EC50
  Tab Delimited (TSV)   2D SDfile   Computed 3D by Vconf -m prep SDfile
Find this compound or compounds like it in BindingDB:
Activity Spreadsheet -- Enzyme Inhibition Constant Data from BindingDB
Found 1 hit for monomerid = 97012
TargetProbable global transcription activator SNF2L2(Homo sapiens (Human))
The Scripps Research Institute Molecular Screening Center
Curated by PubChem BioAssay
LigandPNGBDBM97012(1-(2,4-difluorophenyl)-3-(2-furoylamino)thiourea |...)
Affinity DataEC50:  9.12E+4nM
In DepthDetails PCBioAssay