BDBM97023 2-fluorobenzoic acid [5-chloro-7-(4-morpholinylmethyl)-8-quinolinyl] ester::2-fluorobenzoic acid [5-chloro-7-(morpholinomethyl)-8-quinolyl] ester::MLS002636037::SMR000349875::[5-chloranyl-7-(morpholin-4-ylmethyl)quinolin-8-yl] 2-fluoranylbenzoate::[5-chloro-7-(morpholin-4-ylmethyl)quinolin-8-yl] 2-fluorobenzoate::cid_1534928
SMILES Fc1ccccc1C(=O)Oc1c(CN2CCOCC2)cc(Cl)c2cccnc12
InChI Key InChIKey=SAKAJAITLIDDCU-UHFFFAOYSA-N
Data  1 EC50
  Tab Delimited (TSV)   2D SDfile   Computed 3D by Vconf -m prep SDfile
Find this compound or compounds like it in BindingDB:
Activity Spreadsheet -- Enzyme Inhibition Constant Data from BindingDB
Found 1 hit for monomerid = 97023
TargetProbable global transcription activator SNF2L2(Homo sapiens (Human))
The Scripps Research Institute Molecular Screening Center
Curated by PubChem BioAssay
LigandPNGBDBM97023(2-fluorobenzoic acid [5-chloro-7-(4-morpholinylmet...)
Affinity DataEC50:  9.12E+4nM
In DepthDetails PCBioAssay