BDBM97028 4-amino-N-(5-chloro-2-quinoxalinyl)benzenesulfonamide::4-amino-N-(5-chloroquinoxalin-2-yl)benzenesulfonamide::4-azanyl-N-(5-chloranylquinoxalin-2-yl)benzenesulfonamide::MLS002701830::SMR001565423::cid_72462
SMILES Nc1ccc(cc1)S(=O)(=O)Nc1cnc2c(Cl)cccc2n1
InChI Key InChIKey=CTSNHMQGVWXIEG-UHFFFAOYSA-N
Data  2 IC50  1 EC50
  Tab Delimited (TSV)   2D SDfile   Computed 3D by Vconf -m prep SDfile
Find this compound or compounds like it in BindingDB:
Activity Spreadsheet -- Enzyme Inhibition Constant Data from BindingDB
Found 3 hits for monomerid = 97028
TargetProbable global transcription activator SNF2L2(Homo sapiens (Human))
The Scripps Research Institute Molecular Screening Center
Curated by PubChem BioAssay
LigandPNGBDBM97028(4-amino-N-(5-chloro-2-quinoxalinyl)benzenesulfonam...)
Affinity DataEC50:  9.12E+4nM
In DepthDetails PCBioAssay
TargetSteroidogenic factor 1(Homo sapiens (Human))
The Scripps Research Institute Molecular Screening Center
Curated by PubChem BioAssay
LigandPNGBDBM97028(4-amino-N-(5-chloro-2-quinoxalinyl)benzenesulfonam...)
Affinity DataIC50: >6.75E+4nM
In DepthDetails PCBioAssay
TargetNuclear receptor subfamily 0 group B member 1(Homo sapiens (Human))
The Scripps Research Institute Molecular Screening Center
Curated by PubChem BioAssay
LigandPNGBDBM97028(4-amino-N-(5-chloro-2-quinoxalinyl)benzenesulfonam...)
Affinity DataIC50: >6.75E+4nM
In DepthDetails PCBioAssay