BDBM97213 2-ethoxy-6-[2-(2-quinolinyl)vinyl]phenyl acetate::MLS000675659::SMR000294944::[2-ethoxy-6-[(E)-2-quinolin-2-ylethenyl]phenyl] acetate::[2-ethoxy-6-[(E)-2-quinolin-2-ylethenyl]phenyl] ethanoate::acetic acid [2-ethoxy-6-[(E)-2-(2-quinolinyl)ethenyl]phenyl] ester::acetic acid [2-ethoxy-6-[(E)-2-(2-quinolyl)vinyl]phenyl] ester::cid_5740248
SMILES CCOc1cccc(\C=C\c2ccc3ccccc3n2)c1OC(C)=O
InChI Key InChIKey=FQSDQHJDIJZSAI-WYMLVPIESA-N
Data  2 IC50
  Tab Delimited (TSV)   2D SDfile   Computed 3D by Vconf -m prep SDfile
Find this compound or compounds like it in BindingDB:
Activity Spreadsheet -- Enzyme Inhibition Constant Data from BindingDB
Found 2 hits for monomerid = 97213
TargetSteroidogenic factor 1(Homo sapiens (Human))
The Scripps Research Institute Molecular Screening Center
Curated by PubChem BioAssay
LigandPNGBDBM97213(2-ethoxy-6-[2-(2-quinolinyl)vinyl]phenyl acetate |...)
Affinity DataIC50: >6.75E+4nM
In DepthDetails PCBioAssay
TargetNuclear receptor subfamily 0 group B member 1(Homo sapiens (Human))
The Scripps Research Institute Molecular Screening Center
Curated by PubChem BioAssay
LigandPNGBDBM97213(2-ethoxy-6-[2-(2-quinolinyl)vinyl]phenyl acetate |...)
Affinity DataIC50: >6.75E+4nM
In DepthDetails PCBioAssay