BDBM97323 1-(2-phenylethyl)-3-(2-pyrimidinyl)thiourea::1-(2-phenylethyl)-3-pyrimidin-2-yl-thiourea::1-(2-phenylethyl)-3-pyrimidin-2-ylthiourea::1-phenethyl-3-(2-pyrimidyl)thiourea::MLS002638918::SMR001548380::cid_4557737
SMILES S=C(NCCc1ccccc1)Nc1ncccn1
InChI Key InChIKey=FSTGGFKTMZRTEN-UHFFFAOYSA-N
Data  2 IC50
  Tab Delimited (TSV)   2D SDfile   Computed 3D by Vconf -m prep SDfile
Find this compound or compounds like it in BindingDB:
Activity Spreadsheet -- Enzyme Inhibition Constant Data from BindingDB
Found 2 hits for monomerid = 97323
TargetSteroidogenic factor 1(Homo sapiens (Human))
The Scripps Research Institute Molecular Screening Center
Curated by PubChem BioAssay
LigandPNGBDBM97323(1-(2-phenylethyl)-3-(2-pyrimidinyl)thiourea | 1-(2...)
Affinity DataIC50: >6.75E+4nM
In DepthDetails PCBioAssay
TargetNuclear receptor subfamily 0 group B member 1(Homo sapiens (Human))
The Scripps Research Institute Molecular Screening Center
Curated by PubChem BioAssay
LigandPNGBDBM97323(1-(2-phenylethyl)-3-(2-pyrimidinyl)thiourea | 1-(2...)
Affinity DataIC50: >6.75E+4nM
In DepthDetails PCBioAssay