BDBM97331 MLS002701815::N-(4-formyl-1,2,3,10-tetramethoxy-9-oxo-6,7-dihydro-5H-benzo[a]heptalen-7-yl)acetamide::N-(4-formyl-9-keto-1,2,3,10-tetramethoxy-6,7-dihydro-5H-benzo[a]heptalen-7-yl)acetamide::N-(4-methanoyl-1,2,3,10-tetramethoxy-9-oxidanylidene-6,7-dihydro-5H-benzo[a]heptalen-7-yl)ethanamide::SMR001565408::cid_100064
SMILES COc1c(OC)c(C=O)c2CCC(NC(C)=O)c3cc(=O)c(OC)ccc3-c2c1OC
InChI Key InChIKey=JUWAUXATKRGHCK-UHFFFAOYSA-N
Data  2 IC50
  Tab Delimited (TSV)   2D SDfile   Computed 3D by Vconf -m prep SDfile
Find this compound or compounds like it in BindingDB:
Activity Spreadsheet -- Enzyme Inhibition Constant Data from BindingDB
Found 2 hits for monomerid = 97331
TargetSteroidogenic factor 1(Homo sapiens (Human))
The Scripps Research Institute Molecular Screening Center
Curated by PubChem BioAssay
LigandPNGBDBM97331(MLS002701815 | N-(4-formyl-1,2,3,10-tetramethoxy-9...)
Affinity DataIC50: >6.75E+4nM
In DepthDetails PCBioAssay
TargetNuclear receptor subfamily 0 group B member 1(Homo sapiens (Human))
The Scripps Research Institute Molecular Screening Center
Curated by PubChem BioAssay
LigandPNGBDBM97331(MLS002701815 | N-(4-formyl-1,2,3,10-tetramethoxy-9...)
Affinity DataIC50: >6.75E+4nM
In DepthDetails PCBioAssay