BDBM97467 US8470800, D::US8609833, 93
SMILES O[C@@H]1[C@@H](CO[N+]([O-])=O)O[C@H]([C@@H]1O)n1cnc2c(NC3CCOC3)ncnc12
InChI Key InChIKey=QKLWYFLDTCIMJQ-HVMNINKTSA-N
Data  4 KI
  Tab Delimited (TSV)   2D SDfile   Computed 3D by Vconf -m prep SDfile
Find this compound or compounds like it in BindingDB:
Activity Spreadsheet -- Enzyme Inhibition Constant Data from BindingDB
Found 4 hits for monomerid = 97467
TargetAdenosine receptor A1(Homo sapiens (Human))
Inotek Pharmaceuticals
US Patent
LigandPNGBDBM97467(US8470800, D | US8609833, 93)
Affinity DataKi:  10.6nM ΔG°:  -10.1kcal/molepH: 7.4 T: 2°C. Assay description: Radioligand binding assay using adenosine receptor.
In DepthDetails US Patent
TargetAdenosine receptor A1(Homo sapiens (Human))
Inotek Pharmaceuticals
US Patent
LigandPNGBDBM97467(US8470800, D | US8609833, 93)
Affinity DataKi:  10.6nM. Assay description: The affinities of selected Purine Derivatives for the adenosine A1 receptor were determined by measuring the displacement of specific [3H] 2-chloro-N...
In DepthDetails US Patent
TargetAdenosine receptor A3(Homo sapiens (Human))
Inotek Pharmaceuticals
US Patent
LigandPNGBDBM97467(US8470800, D | US8609833, 93)
Affinity DataKi:  2.02E+3nM. Assay description: The affinities of selected Purine Derivatives for the adenosine A1 receptor were determined by measuring the displacement of specific [3H] 2-chloro-N...
In DepthDetails US Patent
TargetAdenosine receptor A2(Homo sapiens (Human))
Inotek Pharmaceuticals
US Patent
LigandPNGBDBM97467(US8470800, D | US8609833, 93)
Affinity DataKi: >1.00E+5nM. Assay description: The affinities of selected Purine Derivatives for the adenosine A1 receptor were determined by measuring the displacement of specific [3H] 2-chloro-N...
In DepthDetails US Patent