BDBM97621 US8470841, 50
SMILES CC(CCc1ccc(Oc2ccc(OCC3CC3)nc2)cc1)NC(C)=O
InChI Key InChIKey=SZYWRWGPHILDOF-UHFFFAOYSA-N
Data  1 IC50
  Tab Delimited (TSV)   2D SDfile   Computed 3D by Vconf -m prep SDfile
Find this compound or compounds like it in BindingDB:
Activity Spreadsheet -- Enzyme Inhibition Constant Data from BindingDB
Found 1 hit for monomerid = 97621
TargetAcetyl-CoA carboxylase 2 [151-2458](Homo sapiens (Human))
Sanofi
US Patent
LigandPNGBDBM97621(US8470841, 50)
Affinity DataIC50:  170nMpH: 7.5 T: 2°C. Assay description: the enzymatic activity of ACC and its inhibition by test substances were determined by a luminometric assay.
In DepthDetails US Patent