Target
Enoyl-[acyl-carrier-protein] reductase [NADPH] FabI
Ligand
BDBM8726
Substrate
Crotonoyl-ACP
Meas. Tech.
Enzyme Inhibition Assay
pH
6.5±n/a
Temperature
303.15±n/a K
IC50
70±50 nM
Citation
 Miller, WHSeefeld, MANewlander, KAUzinskas, INBurgess, WJHeerding, DAYuan, CCHead, MSPayne, DJRittenhouse, SFMoore, TDPearson, SCBerry, VDeWolf, WEKeller, PMPolizzi, BJQiu, XJanson, CAHuffman, WF Discovery of aminopyridine-based inhibitors of bacterial enoyl-ACP reductase (FabI). J Med Chem 45:3246-56 (2002)  
Target
Name:
Enoyl-[acyl-carrier-protein] reductase [NADPH] FabI
Synonyms:
Enoyl-ACP Reductase (FabI) FABI_STAAR fabI | trans-2-enoyl-[acyl carrier protein] reductase
Type:
Enzyme
Mol. Mass.:
27989.00
Organism:
Staphylococcus aureus
Description:
Q6GI75
Residue:
256
  
Inhibitor
Name:
BDBM8726
Synonyms:
5-chloro-2-(2,4-dichlorophenoxy)phenol TCL US20230414581, Compound 35
Type:
Small organic molecule
Emp. Form.:
C12H7Cl3O2
Mol. Mass.:
289.542
SMILES:
Oc1cc(Cl)ccc1Oc1ccc(Cl)cc1Cl
:
Substrate
Name:
Crotonoyl-ACP
Synonyms:
Type:
Other Protein Type
Mol. Mass.:
358.43
Organism:
Description:
1. NAD(P)H is its co-substrate. 2. Crotonoyl-ACP was synthesized using ACP synthase to catalyse the addition of a crotonoyl group from crotonoyl-CoA to apo-ACP
Residue:
3
NA