Target
Dimer of Gag-Pol polyprotein [501-599,Q508K,L534I,L564I,C568A,C596A]
Ligand
BDBM9164
Substrate
HIV Protease substrate
Meas. Tech.
Protease Inhibition Assay
pH
6.8±n/a
Temperature
298.15±n/a K
Ki
2.8±n/a nM
Citation
 Sherrill, RGFurfine, ESHazen, RJMiller, JFReynolds, DJSammond, DMSpaltenstein, AWheelan, PWright, LL Synthesis and antiviral activities of novel N-alkoxy-arylsulfonamide-based HIV protease inhibitors. Bioorg Med Chem Lett 15:3560-4 (2005)  
Target
Name:
Dimer of Gag-Pol polyprotein [501-599,Q508K,L534I,L564I,C568A,C596A]
Synonyms:
HIV-1 Protease
Type:
Protein Complex
Mol. Mass.:
Description:
Components:
This complex has 2 components.
Component 1
Name:
Gag-Pol polyprotein [501-599,Q508K,L534I,L564I,C568A,C596A]
Synonyms:
HIV-1 Protease chain A gag-pol
Type:
Enzyme Subunit
Mol. Mass.:
10732.11
Organism:
Human immunodeficiency virus type 1
Description:
The HIV-1 protease (Genbank HIVHXB2CG) clone was constructed with the substitutions Q7K, L33I, and L63I, to minimize the autoproteolysis of the protease, and C67A and C95A, to prevent cysteine-thiol oxidation.
Residue:
99
  
Component 2
Name:
Gag-Pol polyprotein [501-599,Q508K,L534I,L564I,C568A,C596A]
Synonyms:
HIV-1 Protease chain A gag-pol
Type:
Enzyme Subunit
Mol. Mass.:
10732.11
Organism:
Human immunodeficiency virus type 1
Description:
The HIV-1 protease (Genbank HIVHXB2CG) clone was constructed with the substitutions Q7K, L33I, and L63I, to minimize the autoproteolysis of the protease, and C67A and C95A, to prevent cysteine-thiol oxidation.
Residue:
99
  
Inhibitor
Name:
BDBM9164
Synonyms:
N-alkoxysulfonamide analog 4 tert-butyl N-[(2S,3R)-4-[(cyclohexyloxy)(4-methoxybenzene)sulfonamido]-3-hydroxy-1-phenylbutan-2-yl]carbamate
Type:
Small organic molecule
Emp. Form.:
C28H40N2O7S
Mol. Mass.:
548.691
SMILES:
COc1ccc(cc1)S(=O)(=O)N(C[C@@H](O)[C@H](Cc1ccccc1)NC(=O)OC(C)(C)C)OC1CCCCC1
:
Substrate
Name:
HIV Protease substrate
Synonyms:
Fluorogenic Peptide Substrate
Type:
Peptide
Mol. Mass.:
3467.28
Organism:
Description:
Residue:
30